{"text_format":"1","workbook":"xlsx","n_sheets":15,"sheets":["Eingabe","Berechnung_UA01","Berechnung_UA02","Berechnung_UA04","Berechnung_UA05","Berechnung_UA06","Berechnung_UA07","Berechnung_UA09","Berechnung_UA50","Hebesatz","Degression_Risiko","Werte Mindestgröße","BKV","Zwischenspeicher","Zusammenfassung"],"not_rendered":{"charts":0,"images":8,"macros":1,"external_links":0,"defined_names":1,"comments":2,"pivot_tables":0},"unopened":[],"bounds":{"document_bytes":16777216,"sheet_cells":100000,"rows_first":2000,"rows_last":500,"rows_between":2000,"halvings":0,"cell_chars":16384,"cell_head_chars":4096},"cells_cut":0,"cells_raw":0,"read":"whole","date_system":"1900"}

{"sheet":"Eingabe","index":0,"n_rows":47,"n_cols":9,"rows_kept":47,"cut":false,"hidden":false,"merged":[[1,1,1,8],[46,3,46,5],[37,1,37,2],[37,4,37,5],[40,3,40,5],[42,3,42,5],[43,3,43,5],[38,3,38,5],[39,3,39,5],[44,3,44,5],[45,3,45,5]]}
[null,"Version Internet P.K. 01.07.2024"]
[null,{"$f":"\"Beitragsberechnung Umlagejahr \" &B6","v":"Beitragsberechnung Umlagejahr 2023"}]
[]
[]
[]
[null,{"$f":"Berechnung_UA01!B3","v":2023}]
[]
[]
[null,"Unternehmensart",null,"Risikobeitrag"," +      Grundbeitrag"," =   Gesamtbeitrag"," -    Bundesmittel"," =   Nettobeitrag"]
[null,null,null,{"$f":"COUNT(D12,D16,D18,D20,D22,D24,D26,D28,D30)","v":0},null,null,{"$f":"IF(Berechnung_UA01!K96>=100,\"x\",\"\")","v":""},null,"Zahlbetrag"]
{"$rows_left_out":38}
{"sheet":"Berechnung_UA01","index":1,"n_rows":106,"n_cols":14,"rows_kept":106,"cut":false,"hidden":true,"merged":[[0,0,0,8]]}
["Beitragsberechnung SVLFG"]
[]
["Jahr",{"$f":"Hebesatz!A3","v":2023}]
[]
[]
[]
["Risikogruppe"]
["Produktionsverfahren"]
["Katasterart","Menge",null,"BER je Einheit","BER PV","Hebesatz","Risikogruppe","Risikofaktor PV","Beitrag",null,"Mindestgröße %"]
["Ackerbau"]
{"$rows_left_out":97}
{"sheet":"Berechnung_UA02","index":2,"n_rows":29,"n_cols":11,"rows_kept":29,"cut":false,"hidden":true,"merged":[[0,0,0,8]]}
["Beitragsberechnung SVLFG"]
[]
["Jahr",{"$f":"Berechnung_UA01!B3","v":2023}]
[]
[]
[]
["Risikogruppe"]
["   Produktionsverfahren"]
["      Katasterart","Menge",null,"BER je Einheit","BER PV","Hebesatz","Risikogruppe","Risikofaktor PV","Beitrag"]
["Pferdehaltung"]
{"$rows_left_out":20}
{"sheet":"Berechnung_UA04","index":3,"n_rows":41,"n_cols":9,"rows_kept":41,"cut":false,"hidden":true,"merged":[[0,0,0,8],[45,5,45,7],[48,6,48,7]]}
["Beitragsberechnung SVLFG"]
[]
["Jahr",{"$f":"Berechnung_UA01!B3","v":2023}]
[]
[]
[]
["Risikogruppe"]
["   Produktionsverfahren"]
["      Katasterart","Menge",null,"BER je Einheit","BER PV","Hebesatz","Risikogruppe","Risikofaktor PV","Beitrag"]
["Rinderhaltung"]
{"$rows_left_out":32}
{"sheet":"Berechnung_UA05","index":4,"n_rows":17,"n_cols":9,"rows_kept":17,"cut":false,"hidden":true,"merged":[[0,0,0,8]]}
["Beitragsberechnung SVLFG"]
[]
[null,null,null,"Jahr",{"$f":"Berechnung_UA01!B3","v":2023}]
["Risikogruppe"]
["   Produktionsverfahren"]
["      Katasterart","Menge",null,"BER je Einheit","BER PV","Hebesatz","Risikogruppe","Risikofaktor PV","Beitrag"]
[]
["Jagdunternehmen"]
["bejagbare Fläche",{"$f":"SUMIF(Zwischenspeicher!$D$2:$D$22,A9,Zwischenspeicher!$B$2:$B$22)","v":0},"ha",{"$f":"Degression_Risiko!E76","v":0.05},{"$f":"ROUND($B$9*D9,4)","v":0},{"$f":"Hebesatz!$B$3","v":7.83},{"$f":"Degression_Risiko!J75","v":1.8911},{"$f":"Degression_Risiko!K76","v":1},{"$f":"ROUND(E9*F9*G9*H9,2)","v":0}]
["Jagd landwirtschaftlicher Unternehmer",{"$f":"SUMIF(Zwischenspeicher!$D$2:$D$22,A10,Zwischenspeicher!$B$2:$B$22)","v":0},"ha",{"$f":"Degression_Risiko!E77","v":0.04},{"$f":"ROUND(B10*D10,4)","v":0},{"$f":"Hebesatz!$B$3","v":7.83},{"$f":"Degression_Risiko!J75","v":1.8911},{"$f":"Degression_Risiko!K77","v":1},{"$f":"ROUND(E10*F10*G10*H10,2)","v":0}]
{"$rows_left_out":8}
{"sheet":"Berechnung_UA06","index":5,"n_rows":26,"n_cols":9,"rows_kept":26,"cut":false,"hidden":true,"merged":[[0,0,0,8]]}
["Beitragsberechnung SVLFG"]
[]
["Jahr",{"$f":"Berechnung_UA01!B3","v":2023}]
[]
[]
[]
["Risikogruppe"]
["   Produktionsverfahren"]
["      Katasterart","Menge",null,"BER je Einheit","BER PV","Hebesatz","Risikogruppe","Risikofaktor PV","Beitrag"]
["Lohnunternehmen einschließlich der Unternehmen des Garten- und Landschaftsbaus "]
{"$rows_left_out":17}
{"sheet":"Berechnung_UA07","index":6,"n_rows":24,"n_cols":9,"rows_kept":24,"cut":false,"hidden":true,"merged":[[0,0,0,8]]}
["Beitragsberechnung SVLFG"]
[]
["Jahr",{"$f":"Berechnung_UA01!B3","v":2023}]
[]
[]
[]
["Risikogruppe"]
["   Produktionsverfahren"]
["      Katasterart","Menge",null,"BER je Einheit","BER PV","Hebesatz","Risikogruppe","Risikofaktor","Beitrag"]
["Beherbergung/Verköstigung, Energiegewinnung, Handel/Verwaltung/Dienstleistung, Veredelung/Produktgewinnung (N1)"]
{"$rows_left_out":15}
{"sheet":"Berechnung_UA09","index":7,"n_rows":18,"n_cols":9,"rows_kept":18,"cut":false,"hidden":true,"merged":[[0,0,0,8]]}
["Beitragsberechnung SVLFG"]
[]
["Jahr",{"$f":"Berechnung_UA01!B3","v":2023}]
[]
[]
[]
["Risikogruppe"]
["   Produktionsverfahren"]
["      Katasterart","Menge",null,"BER je Einheit","BER PV","Hebesatz","Risikogruppe","Risikofaktor PV","Beitrag"]
["Sonstige Unternehmen: Landwirtschaftskammern, Berufsverbände der Landw., Unternehmen, die unmittelbar der Sicherung, Überwachung oder Förderung der Landwirtschaft überwiegend dienen (ohne Unternehmen der Energiegewinnung), SVLFG, ZLA, ZLF, REHA-Fälle"]
{"$rows_left_out":9}
{"sheet":"Berechnung_UA50","index":8,"n_rows":25,"n_cols":9,"rows_kept":25,"cut":false,"hidden":true,"merged":[[0,0,0,8]]}
["Beitragsberechnung SVLFG"]
[]
["Jahr",{"$f":"Berechnung_UA01!B3","v":2023}]
[]
[]
[]
["Risikogruppe"]
["   Produktionsverfahren"]
["      Katasterart","Menge",null,"BER je Einheit","BER PV","Hebesatz","Risikogruppe","Risikofaktor PV","Beitrag"]
["Lohnunternehmen einschließlich der Unternehmen des Garten- und Landschaftsbaus "]
{"$rows_left_out":16}
{"sheet":"Hebesatz","index":9,"n_rows":27,"n_cols":15,"rows_kept":27,"cut":false,"hidden":true,"merged":[[0,21,0,23],[0,5,0,6],[0,9,0,12]]}
["Wertetabelle",null,null,null,null,"JAV ",null,"Ost","West","Grundbeitrag ",null,null,null,"Bumi Kappungsgrenze","Bumi Ausschlussgrenze"]
["Jahr","Hebesatz","Bundesmittel","Deckungsfaktor Grundbeitrag","Fließgruppe","JAV Unternehmer","JAV Mifa","JAV Mifa","JAV Mifa","Höchstgrenze(BER)","Höchstgrenze(€)","Mindestgrenze(BER)","Mindestgrenze(€)"]
[2023,7.83,15.45,0.124,305,15331.73,{"$f":"IF(Eingabe!$C$11=\"w\",I3,H3)","v":24444},23688,24444,350,{"$f":"ROUND(J3*B3*D3,2)","v":339.82},87.5,{"$f":"L3*D3*B3","v":84.955500000000001},20000,50000]
[]
[]
[]
[]
[]
[]
[]
{"$rows_left_out":18}
{"sheet":"Degression_Risiko","index":10,"n_rows":122,"n_cols":11,"rows_kept":122,"cut":false,"hidden":true,"merged":[[2,1,2,2],[1,1,1,10]]}
["a = Konstante, Basiswert, Multiplikator"]
["b = Deg.Faktor, Additionsfaktor, Multiplikationsfaktor",{"$f":"Berechnung_UA01!B3","v":2023}]
[null,"BER Bereich je Einheit",null,"Menge",{"$f":"\"BER \"&B2","v":"BER 2023"},"a","b","Untergrenze","Obergrenze",{"$f":"\"Risikogruppe \"&B2","v":"Risikogruppe 2023"},{"$f":"\"Risikofaktor PV \"&B2","v":"Risikofaktor PV 2023"}]
["Ackerbau","von","bis",null,null,null,null,null,null,1.8455999999999999]
["Mähdrusch, Zuckerrüben",{"$f":"ROUND(F5*H5^G5,4)","v":1.4495},{"$f":"ROUND(F5*I5^G5,4)","v":0.61550000000000005},{"$f":"SUM(Berechnung_UA01!$B$12:$B$13)","v":0},{"$f":"IF(D5=0,0,\nIF(D5<H5,B5,\nIF(AND(D5>=H5,D5<=I5),ROUND(F5*D5^G5,4),\nC5)\n))","v":0},1.4495,-0.124,1,1000,null,1.0992999999999999]
["Futterbau und Bioenergiepflanzen",{"$f":"ROUND(F6*H6^G6,4)","v":1.7795000000000001},{"$f":"ROUND(F6*I6^G6,4)","v":1.0132000000000001},{"$f":"SUM(Berechnung_UA01!$B$15:$B$16)","v":0},{"$f":"IF(D6=0,0,\nIF(D6<H6,B6,\nIF(AND(D6>=H6,D6<=I6),ROUND(F6*D6^G6,4),\nC6)\n))","v":0},1.7795000000000001,-9.4E-2,1,400,null,0.62609999999999999]
["Kartoffeln",5.7008000000000001,1.3265,{"$f":"Berechnung_UA01!$B$17","v":0},{"$f":"IF(D7=0,0,\nIF(D7<H7,B7,\nIF(AND(D7>=H7,D7<=I7),ROUND(F7*D7^G7,4),\nC7)\n))","v":0},5.7008000000000001,-0.29099999999999998,1,150,null,2.0716000000000001]
["Aus der Produktion genommene Flächen",0.44800000000000001,0.1215,{"$f":"SUM(Berechnung_UA01!$B$19:$B$21)","v":0},{"$f":"IF(D8=0,0,\nIF(D8<H8,B8,\nIF(AND(D8>=H8,D8<=I8),ROUND(F8*D8^G8,4),\nC8)\n))","v":0},0.44800000000000001,-0.21,1,500,null,0.78169999999999995]
["Grünland_RK",null,null,null,null,null,null,null,null,3.0344000000000002]
["Almen, Alpen, Hutungen",0.34499999999999997,0.23430000000000001,{"$f":"Berechnung_UA01!$B$23","v":0},{"$f":"IF(D10=0,0,\nIF(D10<H10,B10,\nIF(AND(D10>=H10,D10<=I10),ROUND(F10*D10^G10,4),\nC10)\n))","v":0},0.34499999999999997,-7.2999999999999995E-2,1,200,null,0.99570000000000003]
{"$rows_left_out":113}
{"sheet":"Werte Mindestgröße","index":11,"n_rows":49,"n_cols":5,"rows_kept":49,"cut":false,"hidden":true,"merged":[]}
["Ackerbau","SAP","ISLSV","Mindestgröße","% pro ha /Einheit"]
["Mähdrusch, Zuckerrüben"]
["Mähdruschfrüchte","0041","045",8,{"$f":"100/D3","v":12.5}]
["Zuckerrüben","0005","006",8,{"$f":"100/D4","v":12.5}]
["Futterbau und Bioenergiepflanzen"]
["Futterbau, Bioenergiepflanzen","0042","046",8,12.5]
["Korbweiden","0200","378",8,12.5]
["Kartoffeln","0062","069",8,12.5]
["Aus der Produktion genommene Flächen"]
["Stillegung/Pflege","0129","153",8,12.5]
{"$rows_left_out":40}
{"sheet":"BKV","index":12,"n_rows":116,"n_cols":11,"rows_kept":116,"cut":false,"hidden":true,"merged":[]}
["Unternehmensart","Schlüssel\nKatasterart\nIS2001","Schlüssel\nKatasterart\nIS-LSV","Katasterart Langtext","Dimension","KK-Berechnung\nab 2014","AK-Mindestgröße\nab 2014","Wirtschaftswert LAK","Produktionsverfahren"]
[]
[2,"1589",492,"Abfindungsbrennerei","L","nein","nein",null,"Abfindungsbrennerei",{"$f":"B3","v":"1589"},"Abfindungsbrennerei"]
[1,"0008",10,"Almen, Alpen, Hutungen","HA","300 DM","16 ha","ja","Almen, Alpen, Hutungen",{"$f":"B4","v":"0008"},"Almen, Alpen, Hutungen"]
[9,"3674",270,"Arbeitsentgelt Beschäftigte Verbände","EUR","nein","nein",null,"Verbände","3674","Arbeitsentgelt Beschäftigte Verbände"]
[6,"3157",919,"Arbeitsentgelt forstw. Lohnunternehmen","EUR","nein","nein",null,"Forstw. Lohnunternehmen","3157","Arbeitsentgelt forstw. Lohnunternehmen"]
[50,"5005",281,"Arbeitsentgelt Galabau","EUR","nein","nein",null,"Unternehmen des Garten- und Landschaftsbaus","5005","Arbeitsentgelt Galabau"]
[1,"1122",256,"Arbeitsentgelt gärtnerische Urproduktion","EUR","nein","nein","nein","geschützter gärtnerische Anbau","1122","Arbeitsentgelt gärtnerische Urproduktion"]
[6,"3156",918,"Arbeitsentgelt landw. Lohnunternehmen","EUR","nein","nein",null,"Landw. Lohnunternehmen","3156","Arbeitsentgelt landw. Lohnunternehmen"]
[50,"5011",284,"Arbeitsentgelt Park- und Gartenpflege/Friedhof/Sonstige","EUR","nein","nein",null,"Unternehmen der Park- und Gartenpflege, Friedhöfe sowie Haus- und Ziergärten","5011","Arbeitsentgelt Park- und Gartenpflege/Friedhof/Sonstige"]
{"$rows_left_out":107}
{"sheet":"Zwischenspeicher","index":13,"n_rows":22,"n_cols":5,"rows_kept":22,"cut":false,"hidden":true,"merged":[]}
["Katasterart","Menge","Dimension","Übersetzung für Berechnung"]
[null,null,{"$f":"IF(ISERROR(VLOOKUP(A2,BKV!$D$3:$E$116,2,FALSE)),IF(ISERROR(VLOOKUP(A2,#REF!,3,FALSE)),\"\",VLOOKUP(A2,#REF!,3,FALSE)),VLOOKUP(A2,BKV!$D$3:$E$116,2,FALSE))","v":""},{"$f":"IF(ISERROR(VLOOKUP(A2,BKV!$D$3:$K$116,8,FALSE)),\"\",VLOOKUP(A2,BKV!$D$3:$K$116,8,FALSE))","v":""}]
[null,null,{"$f":"IF(ISERROR(VLOOKUP(A3,BKV!$D$3:$E$116,2,FALSE)),IF(ISERROR(VLOOKUP(A3,#REF!,3,FALSE)),\"\",VLOOKUP(A3,#REF!,3,FALSE)),VLOOKUP(A3,BKV!$D$3:$E$116,2,FALSE))","v":""},{"$f":"IF(ISERROR(VLOOKUP(A3,BKV!$D$3:$K$116,8,FALSE)),\"\",VLOOKUP(A3,BKV!$D$3:$K$116,8,FALSE))","v":""}]
[null,null,{"$f":"IF(ISERROR(VLOOKUP(A4,BKV!$D$3:$E$116,2,FALSE)),IF(ISERROR(VLOOKUP(A4,#REF!,3,FALSE)),\"\",VLOOKUP(A4,#REF!,3,FALSE)),VLOOKUP(A4,BKV!$D$3:$E$116,2,FALSE))","v":""},{"$f":"IF(ISERROR(VLOOKUP(A4,BKV!$D$3:$K$116,8,FALSE)),\"\",VLOOKUP(A4,BKV!$D$3:$K$116,8,FALSE))","v":""}]
[null,null,{"$f":"IF(ISERROR(VLOOKUP(A5,BKV!$D$3:$E$116,2,FALSE)),IF(ISERROR(VLOOKUP(A5,#REF!,3,FALSE)),\"\",VLOOKUP(A5,#REF!,3,FALSE)),VLOOKUP(A5,BKV!$D$3:$E$116,2,FALSE))","v":""},{"$f":"IF(ISERROR(VLOOKUP(A5,BKV!$D$3:$K$116,8,FALSE)),\"\",VLOOKUP(A5,BKV!$D$3:$K$116,8,FALSE))","v":""}]
[null,null,{"$f":"IF(ISERROR(VLOOKUP(A6,BKV!$D$3:$E$116,2,FALSE)),IF(ISERROR(VLOOKUP(A6,#REF!,3,FALSE)),\"\",VLOOKUP(A6,#REF!,3,FALSE)),VLOOKUP(A6,BKV!$D$3:$E$116,2,FALSE))","v":""},{"$f":"IF(ISERROR(VLOOKUP(A6,BKV!$D$3:$K$116,8,FALSE)),\"\",VLOOKUP(A6,BKV!$D$3:$K$116,8,FALSE))","v":""}]
[null,null,{"$f":"IF(ISERROR(VLOOKUP(A7,BKV!$D$3:$E$116,2,FALSE)),IF(ISERROR(VLOOKUP(A7,#REF!,3,FALSE)),\"\",VLOOKUP(A7,#REF!,3,FALSE)),VLOOKUP(A7,BKV!$D$3:$E$116,2,FALSE))","v":""},{"$f":"IF(ISERROR(VLOOKUP(A7,BKV!$D$3:$K$116,8,FALSE)),\"\",VLOOKUP(A7,BKV!$D$3:$K$116,8,FALSE))","v":""}]
[null,null,{"$f":"IF(ISERROR(VLOOKUP(A8,BKV!$D$3:$E$116,2,FALSE)),IF(ISERROR(VLOOKUP(A8,#REF!,3,FALSE)),\"\",VLOOKUP(A8,#REF!,3,FALSE)),VLOOKUP(A8,BKV!$D$3:$E$116,2,FALSE))","v":""},{"$f":"IF(ISERROR(VLOOKUP(A8,BKV!$D$3:$K$116,8,FALSE)),\"\",VLOOKUP(A8,BKV!$D$3:$K$116,8,FALSE))","v":""}]
[null,null,{"$f":"IF(ISERROR(VLOOKUP(A9,BKV!$D$3:$E$116,2,FALSE)),IF(ISERROR(VLOOKUP(A9,#REF!,3,FALSE)),\"\",VLOOKUP(A9,#REF!,3,FALSE)),VLOOKUP(A9,BKV!$D$3:$E$116,2,FALSE))","v":""},{"$f":"IF(ISERROR(VLOOKUP(A9,BKV!$D$3:$K$116,8,FALSE)),\"\",VLOOKUP(A9,BKV!$D$3:$K$116,8,FALSE))","v":""}]
[null,null,{"$f":"IF(ISERROR(VLOOKUP(A10,BKV!$D$3:$E$116,2,FALSE)),IF(ISERROR(VLOOKUP(A10,#REF!,3,FALSE)),\"\",VLOOKUP(A10,#REF!,3,FALSE)),VLOOKUP(A10,BKV!$D$3:$E$116,2,FALSE))","v":""},{"$f":"IF(ISERROR(VLOOKUP(A10,BKV!$D$3:$K$116,8,FALSE)),\"\",VLOOKUP(A10,BKV!$D$3:$K$116,8,FALSE))","v":""}]
{"$rows_left_out":13}
{"sheet":"Zusammenfassung","index":14,"n_rows":360,"n_cols":10,"rows_kept":360,"cut":false,"hidden":true,"merged":[[343,0,343,1],[338,0,338,1],[340,0,340,1],[342,0,342,1],[347,0,347,1],[349,0,349,1],[259,0,259,1],[278,0,278,1],[351,0,351,1],[327,0,327,1],[329,0,329,1],[307,0,307,1],[300,0,300,1],[301,0,301,1],[302,0,302,1],[298,0,298,1],[299,0,299,1],[303,0,303,1],[305,0,305,1],[293,0,293,1],[294,0,294,1],[296,0,296,1],[297,0,297,1],[291,0,291,1],[353,0,353,1],[348,0,348,1],[350,0,350,1],[352,0,352,1],[344,0,344,1],[360,0,360,1],[354,0,354,1],[355,0,355,1],[359,0,359,1],[345,0,345,1],[346,0,346,1],[337,0,337,1],[339,0,339,1],[341,0,341,1],[330,0,330,1],[325,0,325,1],[326,0,326,1],[328,0,328,1],[331,0,331,1],[332,0,332,1],[334,0,334,1],[336,0,336,1],[333,0,333,1],[335,0,335,1],[312,4,314,4],[312,7,314,8],[312,9,314,9],[309,0,309,1],[310,0,310,1],[312,0,314,0],[312,2,314,2],[324,0,324,1],[323,0,323,1],[312,3,314,3],[315,7,315,8],[321,0,321,1],[252,0,252,1],[254,0,254,1],[256,0,256,1],[279,0,279,1],[280,0,280,1],[276,0,276,1],[277,0,277,1],[267,7,267,8],[273,0,273,1],[264,3,266,3],[264,4,266,4],[264,7,266,8],[253,0,253,1],[255,0,255,1],[275,0,275,1],[262,0,262,1],[264,0,266,0],[282,2,284,2],[282,3,284,3],[282,4,284,4],[282,9,284,9],[285,7,285,8],[264,9,266,9],[264,2,266,2],[232,0,232,1],[234,0,234,1],[249,0,249,1],[261,0,261,1],[257,0,257,1],[258,0,258,1],[236,0,236,1],[237,0,237,1],[250,0,250,1],[240,0,242,0],[240,9,242,9],[240,2,242,2],[240,3,242,3],[240,4,242,4],[240,7,242,8],[251,0,251,1],[282,7,284,8],[282,0,284,0],[233,0,233,1],[193,3,195,3],[193,4,195,4],[193,7,195,8],[193,9,195,9],[190,0,190,1],[191,0,191,1],[193,0,195,0],[193,2,195,2],[229,0,229,1],[224,0,224,1],[226,0,226,1],[228,0,228,1],[196,7,196,8],[205,0,205,1],[208,0,208,1],[209,0,209,1],[211,0,213,0],[206,0,206,1],[207,0,207,1],[223,0,223,1],[225,0,225,1],[227,0,227,1],[178,0,178,1],[180,0,180,1],[183,0,183,1],[188,0,188,1],[189,0,189,1],[179,0,179,1],[181,0,181,1],[186,0,186,1],[187,0,187,1],[171,0,171,1],[173,0,173,1],[175,0,175,1],[177,0,177,1],[172,0,172,1],[174,0,174,1],[176,0,176,1],[162,0,162,1],[164,0,164,1],[168,0,168,1],[170,0,170,1],[163,0,163,1],[165,0,165,1],[169,0,169,1],[25,0,25,1],[30,0,30,1],[31,0,31,1],[129,0,131,0],[129,2,131,2],[129,3,131,3],[13,0,13,1],[14,0,14,1],[15,0,15,1],[32,0,32,1],[26,0,26,1],[27,0,27,1],[28,0,28,1],[38,0,38,1],[39,0,39,1],[40,0,40,1],[41,0,41,1],[42,0,42,1],[43,0,43,1],[29,0,29,1],[33,0,33,1],[34,0,34,1],[35,0,35,1],[36,0,36,1],[0,0,0,1],[1,0,1,1],[2,0,2,1],[3,0,3,1],[23,0,23,1],[24,0,24,1],[22,0,22,1],[4,0,4,1],[5,0,5,1],[6,0,6,1],[16,0,16,1],[7,0,7,1],[8,0,8,1],[9,0,9,1],[10,0,10,1],[11,0,11,1],[12,0,12,1],[17,0,17,1],[18,0,18,1],[19,0,19,1],[20,0,20,1],[21,0,21,1],[59,0,59,1],[62,0,62,1],[63,0,63,1],[60,0,60,1],[61,0,61,1],[64,0,64,1],[37,0,37,1],[53,0,53,1],[54,0,54,1],[56,0,56,1],[57,0,57,1],[55,0,55,1],[58,0,58,1],[44,0,44,1],[45,0,45,1],[46,0,46,1],[48,0,48,1],[51,0,51,1],[47,0,47,1],[49,0,49,1],[52,0,52,1],[73,0,73,1],[69,0,69,1],[70,0,70,1],[74,0,74,1],[76,0,76,1],[77,0,77,1],[65,0,65,1],[66,0,66,1],[67,0,67,1],[68,0,68,1],[71,0,71,1],[72,0,72,1],[83,0,83,1],[84,0,84,1],[85,0,85,1],[86,0,86,1],[89,0,89,1],[90,0,90,1],[78,0,78,1],[75,0,75,1],[79,0,79,1],[80,0,80,1],[81,0,81,1],[82,0,82,1],[101,0,101,1],[102,0,102,1],[103,0,103,1],[91,0,91,1],[87,0,87,1],[88,0,88,1],[92,0,92,1],[93,0,93,1],[94,0,94,1],[95,0,95,1],[96,0,96,1],[97,0,97,1],[98,0,98,1],[99,0,99,1],[100,0,100,1],[104,0,104,1],[105,0,105,1],[106,0,106,1],[114,0,114,1],[118,0,118,1],[111,0,111,1],[112,0,112,1],[113,0,113,1],[119,0,119,1],[108,0,108,1],[116,0,116,1],[157,0,157,1],[155,0,155,1],[126,0,126,1],[127,0,127,1],[125,0,125,1],[109,0,109,1],[110,0,110,1],[117,0,117,1],[122,0,122,1],[120,0,120,1],[121,0,121,1],[129,4,131,4],[124,0,124,1],[123,0,123,1],[129,9,131,9],[129,7,131,8],[146,0,146,1],[148,0,148,1],[230,0,230,1],[231,0,231,1],[150,0,150,1],[151,0,151,1],[132,7,132,8],[159,0,159,1],[161,0,161,1],[158,0,158,1],[143,0,143,1],[145,0,145,1],[147,0,147,1],[149,0,149,1],[144,0,144,1],[160,0,160,1],[153,0,153,1],[154,0,154,1],[156,0,156,1],[235,0,235,1],[243,7,243,8],[238,0,238,1],[211,9,213,9],[214,7,214,8],[211,2,213,2],[211,3,213,3],[211,4,213,4],[211,7,213,8],[222,0,222,1]]}
["Risikogruppe\n   Produktionsverfahren (PV)",null,"Menge",null,"BER \nje Einheit","BER\nPV","Hebe-satz (EUR je BER)","Risiko-grup-pen-faktor","Risiko-faktor PV","Beitrag in EUR"]
["Ackerbau",null,{"$f":"SUM(C3:C15)","v":0}]
["Mähdrusch, Zuckerrüben",null,{"$f":"SUM(C4:C5)","v":0},null,null,{"$f":"Berechnung_UA01!E11","v":0},{"$f":"Berechnung_UA01!F11","v":7.83},{"$f":"Berechnung_UA01!G11","v":1.8455999999999999},{"$f":"Berechnung_UA01!H11","v":1.0992999999999999},{"$f":"Berechnung_UA01!I11","v":0}]
["Mähdruschfrüchte",null,{"$f":"Berechnung_UA01!B12","v":0},{"$f":"Berechnung_UA01!C12","v":"ha"},{"$f":"Berechnung_UA01!D12","v":0},{"$f":"Berechnung_UA01!E12","v":0}]
["Zuckerrüben",null,{"$f":"Berechnung_UA01!B13","v":0},{"$f":"Berechnung_UA01!C13","v":"ha"},{"$f":"Berechnung_UA01!D13","v":0},{"$f":"Berechnung_UA01!E13","v":0}]
["Futterbau und Bioenergiepflanzen",null,{"$f":"SUM(C7:C8)","v":0},null,null,{"$f":"Berechnung_UA01!E14","v":0},{"$f":"Berechnung_UA01!F14","v":7.83},{"$f":"Berechnung_UA01!G14","v":1.8455999999999999},{"$f":"Berechnung_UA01!H14","v":0.62609999999999999},{"$f":"Berechnung_UA01!I14","v":0}]
["Futterbau, Bioenergiepflanzen",null,{"$f":"Berechnung_UA01!B15","v":0},{"$f":"Berechnung_UA01!C15","v":"ha"},{"$f":"Berechnung_UA01!D15","v":0},{"$f":"Berechnung_UA01!E15","v":0}]
["Korbweiden",null,{"$f":"Berechnung_UA01!B16","v":0},{"$f":"Berechnung_UA01!C16","v":"ha"},{"$f":"Berechnung_UA01!D16","v":0},{"$f":"Berechnung_UA01!E16","v":0}]
["Kartoffeln",null,{"$f":"C10","v":0},null,null,{"$f":"Berechnung_UA01!E17","v":0},{"$f":"Berechnung_UA01!F17","v":7.83},{"$f":"Berechnung_UA01!G17","v":1.8455999999999999},{"$f":"Berechnung_UA01!H17","v":2.0716000000000001},{"$f":"Berechnung_UA01!I17","v":0}]
["Kartoffeln",null,{"$f":"Berechnung_UA01!B17","v":0},{"$f":"Berechnung_UA01!C17","v":"ha"},{"$f":"Berechnung_UA01!D17","v":0},{"$f":"Berechnung_UA01!E17","v":0}]
{"$rows_left_out":350}